Target
Tumor necrosis factor
Ligand
BDBM296864
Substrate
Meas. Tech.
TNF or CD40L-Induced HEK-Blue Assay
IC50
<1000±n/a nM
Citation
 Marcin, LRWrobleski, STDhar, TM Heterocyclic compounds useful as inhibitors of TNF US Patent  US10112944 Publication Date 10/30/2018 
Target
Name:
Tumor necrosis factor
Synonyms:
Cachectin TNF-a TNFA TNFSF2 Tumor necrosis factor (TNFa) Tumor necrosis factor ligand superfamily member 2 Tumor necrosis factor, soluble form | tumor necrosis factor alpha
Type:
Enzyme
Mol. Mass.:
25645.11
Organism:
Homo sapiens (Human)
Description:
P01375
Residue:
233
  
Inhibitor
Name:
BDBM296864
Synonyms:
1-(2-(Difluoromethoxy)phenyl)-8-(6-methoxypyridin-3-yl)-4-methyl-1,2,3,4-tetrahydroimidazo[1,2-a:5,4-b′]dipyridine | US10112944, Example 38
Type:
Small organic molecule
Emp. Form.:
C24H21F3N4O2
Mol. Mass.:
454.4443
SMILES:
CC1CCN(c2c1nc1ccc(cn21)-c1ccc(CO)nc1)c1ccccc1OC(F)(F)F
: