Target
Activin receptor type-1B
Ligand
BDBM280352
Substrate
Meas. Tech.
In Vitro Kinase Assay
IC50
11.0±n/a nM
Citation
 Rai, RChakravarty, SPujala, BShinde, BUNayak, AKChaklan, NAgarwal, AKRamachandran, SAPham, SM Compounds and methods of use US Patent  US10501436 Publication Date 12/10/2019 
Target
Name:
Activin receptor type-1B
Synonyms:
ACV1B_HUMAN ACVRLK4 Activin receptor type-1B/Activin receptor-like kinase 4 (ALK-4)
Type:
PROTEIN
Mol. Mass.:
56810.99
Organism:
Homo sapiens (Human)
Description:
ChEMBL_587064
Residue:
505
  
Inhibitor
Name:
BDBM280352
Synonyms:
N-(2-aminoethyl)-4-[[2-(5-chloro-2-fluoro-phenyl)-5-isopropyl-4-pyridyl]amino]pyridine-3-carboxamide US10501436, Compound 19 | US11702401, Compound 19
Type:
Small organic molecule
Emp. Form.:
C27H31ClFN5O3
Mol. Mass.:
528.018
SMILES:
CC(C)c1cnc(cc1Nc1ccncc1C(=O)NCCNC(=O)OC(C)(C)C)-c1cc(Cl)ccc1F
: