Target
Activin receptor type-1B
Ligand
BDBM280365
Substrate
Meas. Tech.
In Vitro Kinase Assay
IC50
4.80±n/a nM
Citation
 Rai, RChakravarty, SPujala, BShinde, BUNayak, AKChaklan, NAgarwal, AKRamachandran, SAPham, SM Compounds and methods of use US Patent  US10501436 Publication Date 12/10/2019 
Target
Name:
Activin receptor type-1B
Synonyms:
ACV1B_HUMAN ACVRLK4 Activin receptor type-1B/Activin receptor-like kinase 4 (ALK-4)
Type:
PROTEIN
Mol. Mass.:
56810.99
Organism:
Homo sapiens (Human)
Description:
ChEMBL_587064
Residue:
505
  
Inhibitor
Name:
BDBM280365
Synonyms:
4-{[2-(5-chloro-2-fluorophenyl)-5-cyclopropylpyridin-4-yl]amino}-N-[(2S)-2-hydroxypropyl]pyridine-3-carboxamide US10501436, Compound 31 US11702401, Compound 31
Type:
Small organic molecule
Emp. Form.:
C23H22ClFN4O2
Mol. Mass.:
440.898
SMILES:
C[C@H](O)CNC(=O)c1cnccc1Nc1cc(ncc1C1CC1)-c1cc(Cl)ccc1F
: