Target
Lysine-specific histone demethylase 1A
Ligand
BDBM111127
Substrate
Meas. Tech.
LSD1 Histone Demethylase Biochemical Assay
pH
7.5±n/a
IC50
<50±n/a nM
Comments
extracted
Citation
 Wu, LCourter, JRHe, CLi, JLu, LSun, YWang, XYao, WZhang, CZhuo, J Substituted imidazo[1,2-a]pyrazines as LSD1 inhibitors US Patent  US10112950 Publication Date 10/30/2018 
Target
Name:
Lysine-specific histone demethylase 1A
Synonyms:
AOF2 Flavin-containing amine oxidase domain-containing protein 2 KDM1A KIAA0601 Lysine-specific demethylase 1 (LSD1) Lysine-specific histone demethylase 1 (LSD1)
Type:
Enzyme
Mol. Mass.:
92901.01
Organism:
Homo sapiens (Human)
Description:
O60341
Residue:
852
  
Inhibitor
Name:
BDBM111127
Synonyms:
US10112950, Example 2 US9695180, 2
Type:
Small organic molecule
Emp. Form.:
C26H25N5
Mol. Mass.:
407.5102
SMILES:
Cc1ccc(cc1)-c1c(nc(CCC2CCNC2)c2nccn12)-c1ccc(cc1)C#N
: