Target
Lysine-specific histone demethylase 1A
Ligand
BDBM296878
Substrate
Meas. Tech.
LSD1 Histone Demethylase Biochemical Assay
pH
7.5±n/a
IC50
<50±n/a nM
Comments
extracted
Citation
 Wu, LCourter, JRHe, CLi, JLu, LSun, YWang, XYao, WZhang, CZhuo, J Substituted imidazo[1,2-a]pyrazines as LSD1 inhibitors US Patent  US10112950 Publication Date 10/30/2018 
Target
Name:
Lysine-specific histone demethylase 1A
Synonyms:
AOF2 Flavin-containing amine oxidase domain-containing protein 2 KDM1A KIAA0601 Lysine-specific demethylase 1 (LSD1) Lysine-specific histone demethylase 1 (LSD1)
Type:
Enzyme
Mol. Mass.:
92901.01
Organism:
Homo sapiens (Human)
Description:
O60341
Residue:
852
  
Inhibitor
Name:
BDBM296878
Synonyms:
4-(5-(4-methylphenyl)-8-{[(3R)-1-methylpyrrolidin-3-yl]methoxy}imidazo[1,2-a]pyrazin-6-yl)benzonitrile | US10112950, Example 11
Type:
Small organic molecule
Emp. Form.:
C26H25N5O
Mol. Mass.:
423.5096
SMILES:
CN1CC[C@@H](COc2nc(-c3ccc(cc3)[N+]#[C-])c(-c3ccc(C)cc3)n3ccnc23)C1
: