Target
Lysine-specific histone demethylase 1A
Ligand
BDBM112388
Substrate
Meas. Tech.
LSD1 Histone Demethylase Biochemical Assay
pH
7.5±n/a
IC50
275±n/a nM
Comments
extracted
Citation
 Wu, LCourter, JRHe, CLi, JLu, LSun, YWang, XYao, WZhang, CZhuo, J Substituted imidazo[1,2-a]pyrazines as LSD1 inhibitors US Patent  US10112950 Publication Date 10/30/2018 
Target
Name:
Lysine-specific histone demethylase 1A
Synonyms:
AOF2 Flavin-containing amine oxidase domain-containing protein 2 KDM1A KIAA0601 Lysine-specific demethylase 1 (LSD1) Lysine-specific histone demethylase 1 (LSD1)
Type:
Enzyme
Mol. Mass.:
92901.01
Organism:
Homo sapiens (Human)
Description:
O60341
Residue:
852
  
Inhibitor
Name:
BDBM112388
Synonyms:
US10112950, Example 84 US9695180, 84
Type:
Small organic molecule
Emp. Form.:
C26H25FN6O2
Mol. Mass.:
472.5141
SMILES:
COc1ncc(cc1F)-c1c(nc(OC[C@@H]2CCCN(C)C2)c2nccn12)-c1ccc(cc1)C#N
: