Target
Non-receptor tyrosine-protein kinase TYK2
Ligand
BDBM350094
Substrate
Meas. Tech.
Biochemical JAK Kinase Assays
Ki
0.080±n/a nM
Citation
 Fatheree, PRBrandt, GESmith, CSullivan, SDVan Orden, LJKleinschek, MACrater, GD Fused imidazo-piperidine JAK inhibitors US Patent  US10519153 Publication Date 12/31/2019 
Target
Name:
Non-receptor tyrosine-protein kinase TYK2
Synonyms:
Non-receptor tyrosine-protein kinase TYK2 (TYK2) TYK2_HUMAN | Tyrosine-protein kinase TYK2
Type:
Protein
Mol. Mass.:
133666.03
Organism:
Homo sapiens (Human)
Description:
P29597
Residue:
1187
  
Inhibitor
Name:
BDBM350094
Synonyms:
US10208040, Example 1-2 | US10519153, Example 1-2
Type:
Small organic molecule
Emp. Form.:
C29H34FN7O2
Mol. Mass.:
531.6244
SMILES:
CCc1cc(O)c(F)cc1-c1ccc2c(n[nH]c2c1)-c1nc2CC(NCc2[nH]1)C(=O)N1CCN(CC1)C(C)C
: