Target
Bromodomain-containing protein 4
Ligand
BDBM297242
Substrate
Meas. Tech.
TR-FRET Assay
IC50
<5±n/a nM
Citation
 Norris, DJDelucca, GVGavai, AVLee, FYTokarski, JS Tricyclic compounds as anticancer agents US Patent  US10112941 Publication Date 10/30/2018 
Target
Name:
Bromodomain-containing protein 4
Synonyms:
BRD4 Bromodomain-containing protein 4 (BRD4) Protein HUNK1
Type:
Protein
Mol. Mass.:
152264.84
Organism:
Homo sapiens (Human)
Description:
O60885
Residue:
1362
  
Inhibitor
Name:
BDBM297242
Synonyms:
Ethyl N-[3-(dimethyl-1H-1,2,3-triazol-5-yl)-5-[(S)-oxan-4-yl(phenyl)methyl]-5H-pyrido[3,2-b]indol-7-yl]carbamate | US10112941, Example 366
Type:
Small organic molecule
Emp. Form.:
C30H32N6O3
Mol. Mass.:
524.6135
SMILES:
CCOC(=O)Nc1ccc2c(c1)n([C@@H](C1CCOCC1)c1ccccc1)c1cc(cnc21)-c1c(C)nnn1C
: