Target
Bromodomain-containing protein 4
Ligand
BDBM297318
Substrate
Meas. Tech.
TR-FRET Assay
IC50
<5±n/a nM
Citation
 Norris, DJDelucca, GVGavai, AVLee, FYTokarski, JS Tricyclic compounds as anticancer agents US Patent  US10112941 Publication Date 10/30/2018 
Target
Name:
Bromodomain-containing protein 4
Synonyms:
BRD4 Bromodomain-containing protein 4 (BRD4) Protein HUNK1
Type:
Protein
Mol. Mass.:
152264.84
Organism:
Homo sapiens (Human)
Description:
O60885
Residue:
1362
  
Inhibitor
Name:
BDBM297318
Synonyms:
1-Cyclopropyl-1-[3-(dimethyl-1H-1,2,3-triazol-5-yl)-8-fluoro-5-[(S)-(2-fluorophenyl)(oxan-4-yl)methyl]-5H-pyrido[3,2-b]indol-7-yl]ethan-1-ol US10112941, Example 448
Type:
Small organic molecule
Emp. Form.:
C32H34F2N5O2
Mol. Mass.:
558.6415
SMILES:
Cc1[nH]nn(C)c1-c1cnc2c(c1)n([C@@H](C1CCOCC1)c1ccccc1F)c1cc(c(F)cc21)C(C)(O)C1CC1
: