Target
MAP kinase-interacting serine/threonine-protein kinase 1
Ligand
BDBM297339
Substrate
Meas. Tech.
MNK Biochemical Enzymatic Assay
IC50
5050±n/a nM
Citation
 Sprengeler, PAReich, SHErnst, JTWebber, SEShaghafi, MMurphy, DTran, C Isoindoline, azaisoindoline, dihydroindenone and dihydroazaindenone inhibitors of Mnk1 and Mnk2 US Patent  US10112955 Publication Date 10/30/2018 
Target
Name:
MAP kinase-interacting serine/threonine-protein kinase 1
Synonyms:
MAP Kinase-Interacting Protein Kinase (MNK1) MAP kinase-interacting serine/threonine-protein kinase 1 (MnK1) MAP-kinase interacting kinase 1 (MNK1) MKNK1 MNK1
Type:
Serine/threonine-protein kinase
Mol. Mass.:
51342.85
Organism:
Homo sapiens (Human)
Description:
Q9BUB5
Residue:
465
  
Inhibitor
Name:
BDBM297339
Synonyms:
5-((6-chloropyrimidin-4-yl)amino)isoindolin-1-one (Cpd. No. 4F) | US10112955, Example 4
Type:
Small organic molecule
Emp. Form.:
C12H9ClN4O
Mol. Mass.:
260.679
SMILES:
Clc1cc(Nc2ccc3C(=O)NCc3c2)ncn1
: