Target
MAP kinase-interacting serine/threonine-protein kinase 2
Ligand
BDBM297366
Substrate
IC50
<10±n/a nM
Citation
 Sprengeler, PAReich, SHErnst, JTWebber, SEShaghafi, MMurphy, DTran, C Isoindoline, azaisoindoline, dihydroindenone and dihydroazaindenone inhibitors of Mnk1 and Mnk2 US Patent  US10112955 Publication Date 10/30/2018 
Target
Name:
MAP kinase-interacting serine/threonine-protein kinase 2
Synonyms:
GPRK7 MAP kinase-interacting serine/threonine-protein kinase 2 (MKNK2) MAP-kinase interacting kinase 2 (MNK2) MKNK2_HUMAN | MNK2
Type:
Protein
Mol. Mass.:
51870.79
Organism:
Homo sapiens (Human)
Description:
Q9HBH9
Residue:
465
  
Inhibitor
Name:
BDBM297366
Synonyms:
7-chloro-3,3-dimethyl-5-(pyrimidin-4-ylamino)isoindolin-1-one (Cpd. No. 36) | US10112955, Example 36
Type:
Small organic molecule
Emp. Form.:
C14H13ClN4O
Mol. Mass.:
288.732
SMILES:
CC1(C)NC(=O)c2c1cc(Nc1ccncn1)cc2Cl
: