Target
MAP kinase-interacting serine/threonine-protein kinase 2
Ligand
BDBM297369
Substrate
IC50
5050±n/a nM
Citation
 Sprengeler, PAReich, SHErnst, JTWebber, SEShaghafi, MMurphy, DTran, C Isoindoline, azaisoindoline, dihydroindenone and dihydroazaindenone inhibitors of Mnk1 and Mnk2 US Patent  US10112955 Publication Date 10/30/2018 
Target
Name:
MAP kinase-interacting serine/threonine-protein kinase 2
Synonyms:
GPRK7 MAP kinase-interacting serine/threonine-protein kinase 2 (MKNK2) MAP-kinase interacting kinase 2 (MNK2) MKNK2_HUMAN | MNK2
Type:
Protein
Mol. Mass.:
51870.79
Organism:
Homo sapiens (Human)
Description:
Q9HBH9
Residue:
465
  
Inhibitor
Name:
BDBM297369
Synonyms:
5-(6,7-dihydro-5H-pyrrolo[2,3-d]pyrimidin-4-ylamino)-3-methyl-isoindolin-1-one (Cpd. No. 39) | US10112955, Example 39
Type:
Small organic molecule
Emp. Form.:
C15H15N5O
Mol. Mass.:
281.3125
SMILES:
CC1NC(=O)c2ccc(Nc3ncnc4NCCc34)cc12
: