Target
MAP kinase-interacting serine/threonine-protein kinase 2
Ligand
BDBM297370
Substrate
IC50
5050±n/a nM
Citation
 Sprengeler, PAReich, SHErnst, JTWebber, SEShaghafi, MMurphy, DTran, C Isoindoline, azaisoindoline, dihydroindenone and dihydroazaindenone inhibitors of Mnk1 and Mnk2 US Patent  US10112955 Publication Date 10/30/2018 
Target
Name:
MAP kinase-interacting serine/threonine-protein kinase 2
Synonyms:
GPRK7 MAP kinase-interacting serine/threonine-protein kinase 2 (MKNK2) MAP-kinase interacting kinase 2 (MNK2) MKNK2_HUMAN | MNK2
Type:
Protein
Mol. Mass.:
51870.79
Organism:
Homo sapiens (Human)
Description:
Q9HBH9
Residue:
465
  
Inhibitor
Name:
BDBM297370
Synonyms:
3-(aminomethyl)-3-methyl-5-(pyrimidin-4-ylamino)isoindolin-1-one hydrochloride salt (Cpd. No. 40) | US10112955, Example 40
Type:
Small organic molecule
Emp. Form.:
C14H15N5O
Mol. Mass.:
269.3018
SMILES:
CC1(CN)NC(=O)c2ccc(Nc3ccncn3)cc12
: