Target
MAP kinase-interacting serine/threonine-protein kinase 2
Ligand
BDBM297386
Substrate
IC50
<10±n/a nM
Citation
 Sprengeler, PAReich, SHErnst, JTWebber, SEShaghafi, MMurphy, DTran, C Isoindoline, azaisoindoline, dihydroindenone and dihydroazaindenone inhibitors of Mnk1 and Mnk2 US Patent  US10112955 Publication Date 10/30/2018 
Target
Name:
MAP kinase-interacting serine/threonine-protein kinase 2
Synonyms:
GPRK7 MAP kinase-interacting serine/threonine-protein kinase 2 (MKNK2) MAP-kinase interacting kinase 2 (MNK2) MKNK2_HUMAN | MNK2
Type:
Protein
Mol. Mass.:
51870.79
Organism:
Homo sapiens (Human)
Description:
Q9HBH9
Residue:
465
  
Inhibitor
Name:
BDBM297386
Synonyms:
6'-((6-amino-5-methoxypyrimidin-4-yl)amino)-4'-methylspiro[cyclohexane-1,1'-isoindolin]-3'-one (Cpd. No. 57) | US10112955, Example 57
Type:
Small organic molecule
Emp. Form.:
C19H23N5O2
Mol. Mass.:
353.4182
SMILES:
COc1c(N)ncnc1Nc1cc2c(C(=O)NC22CCCCC2)c(C)c1
: