Target
Cytochrome P450 3A4
Ligand
BDBM151585
Substrate
BDBM8885
Meas. Tech.
Extracellular Cytochrome P450 Inhibition Assay
pH
7.4±n/a
IC50
20±n/a nM
Comments
extracted
Citation
 PubChem, PCBrittain, JEKing, CDStearns, BA DP2 antagonist and uses thereof US Patent  US9688624 Publication Date 6/27/2017 
Target
Name:
Cytochrome P450 3A4
Synonyms:
Albendazole monooxygenase CP3A4_HUMAN CYP3A4 CYPIIIA4 Cytochrome P450 3A4 (CYP3A4) Nifedipine oxidase Taurochenodeoxycholate 6-alpha-hydroxylase
Type:
Enzyme
Mol. Mass.:
57349.57
Organism:
Homo sapiens (Human)
Description:
Residue:
503
  
Inhibitor
Name:
BDBM151585
Synonyms:
US11739089, Compound Ketoconazole US9180183, Ketoconazole US9394290, KTZ (ketoconazole) | US9963439, Ketoconazole
Type:
Small organic molecule
Emp. Form.:
C26H28Cl2N4O4
Mol. Mass.:
531.431
SMILES:
CC(=O)N1CCN(CC1)c1ccc(OCC2COC(Cn3ccnc3)(O2)c2ccc(Cl)cc2Cl)cc1
:
Substrate
Name:
BDBM8885
Synonyms:
(1S,2R,10R,11S,14S,15S)-14-hydroxy-2,15-dimethyltetracyclo[8.7.0.0^{2,7}.0^{11,15}]heptadec-6-en-5-one Testosterone US9682960, Testosterone
Type:
Steroid
Emp. Form.:
C19H28O2
Mol. Mass.:
288.4244
SMILES:
[H][C@@]12CC[C@H](O)[C@@]1(C)CC[C@@]1([H])[C@@]2([H])CCC2=CC(=O)CC[C@]12C
: