Target
5-hydroxytryptamine receptor 2C
Ligand
BDBM428840
Substrate
Meas. Tech.
Intracellular Calcium Assay
EC50
0.330±0.1 nM
Citation
 Cunningham, KAGilbertson, SR 5-HT2CR agonist analogs US Patent  US10544152 Publication Date 1/28/2020 
Target
Name:
5-hydroxytryptamine receptor 2C
Synonyms:
5-HT-2C 5-HT2C-INI 5-HTR2C 5-hydroxytryptamine receptor 2C (5-HT-2C) 5HT-1C HTR1C Serotonin (5-HT3) receptor Serotonin Receptor 2C
Type:
G Protein-Coupled Receptor (GPCR)
Mol. Mass.:
51836.79
Organism:
Homo sapiens (Human)
Description:
P28335
Residue:
458
  
Inhibitor
Name:
BDBM428840
Synonyms:
US10544152, Cpd # 27
Type:
Small organic molecule
Emp. Form.:
C10H11NO2
Mol. Mass.:
177.1998
SMILES:
OCCc1c[nH]c2ccc(O)cc12
: