Target
Replicase polyprotein 1ab
Ligand
BDBM428977
Substrate
Meas. Tech.
No assay is provided
IC50
880±n/a nM
Citation
 Pillaiyar, TManickam, MNamasivayam, VHayashi, YJung, SH An Overview of Severe Acute Respiratory Syndrome-Coronavirus (SARS-CoV) 3CL Protease Inhibitors: Peptidomimetics and Small Molecule Chemotherapy. J Med Chem 59:6595-628 (2016)  
Target
Name:
Replicase polyprotein 1ab
Synonyms:
ORF1ab polyprotein pp1ab | rep
Type:
Protein
Mol. Mass.:
754187.17
Organism:
HCoV-229E
Description:
P0C6X1
Residue:
6758
  
Inhibitor
Name:
BDBM428977
Synonyms:
jm5b01461, Compound 18
Type:
Small Organic Molecule
Emp. Form.:
C33H50N4O8
Mol. Mass.:
630.7721
SMILES:
CCOC(=O)C=C[C@H](C[C@@H]1CCNC1=O)NC(=O)[C@@H](CC(C)C)NC(=O)[C@@H](NC(=O)OCc1ccccc1)C(C)OC(C)(C)C
: