Target
Replicase polyprotein 1ab
Ligand
BDBM429271
Substrate
Meas. Tech.
No assay is provided
IC50
32700±n/a nM
Citation
 Pillaiyar, TManickam, MNamasivayam, VHayashi, YJung, SH An Overview of Severe Acute Respiratory Syndrome-Coronavirus (SARS-CoV) 3CL Protease Inhibitors: Peptidomimetics and Small Molecule Chemotherapy. J Med Chem 59:6595-628 (2016)  
Target
Name:
Replicase polyprotein 1ab
Synonyms:
3C-like proteinase 3C-like proteinase (SARS-CoV 3Cpro) 3CLp GFL Guanine-N7 methyltransferase Helicase Leader protein Non-structural protein 10 Non-structural protein 3 Non-structural protein 6 Non-structural protein 8 ORF1ab polyprotein PL2-PRO Pol R1AB_SARS RdRp SARS coronavirus main proteinase nsp1 nsp12 nsp14 nsp16 nsp3 nsp5 nsp7 nsp9 pp1ab | rep
Type:
Protein
Mol. Mass.:
790250.81
Organism:
Human SARS coronavirus (SARS-CoV) (Severe acute respiratory syndrome coronavirus)
Description:
P0C6X7
Residue:
7073
  
Inhibitor
Name:
BDBM429271
Synonyms:
acs.jmedchem.1c00409_ST.661 | jm5b01461, Compound 89
Type:
Small Organic Molecule
Emp. Form.:
C32H22O10
Mol. Mass.:
566.5111
SMILES:
COc1cc(O)c2c(c1)oc(cc2=O)-c1ccc(OC)c(c1)-c1c(O)cc(O)c2c1oc(cc2=O)-c1ccc(O)cc1
: