Target
Replicase polyprotein 1ab
Ligand
BDBM429321
Substrate
Meas. Tech.
No assay is provided
IC50
108000±n/a nM
Citation
 Pillaiyar, TManickam, MNamasivayam, VHayashi, YJung, SH An Overview of Severe Acute Respiratory Syndrome-Coronavirus (SARS-CoV) 3CL Protease Inhibitors: Peptidomimetics and Small Molecule Chemotherapy. J Med Chem 59:6595-628 (2016)  
Target
Name:
Replicase polyprotein 1ab
Synonyms:
3C-like proteinase 3C-like proteinase (SARS-CoV 3Cpro) 3CLp GFL Guanine-N7 methyltransferase Helicase Leader protein Non-structural protein 10 Non-structural protein 3 Non-structural protein 6 Non-structural protein 8 ORF1ab polyprotein PL2-PRO Pol R1AB_SARS RdRp SARS coronavirus main proteinase nsp1 nsp12 nsp14 nsp16 nsp3 nsp5 nsp7 nsp9 pp1ab | rep
Type:
Protein
Mol. Mass.:
790250.81
Organism:
Human SARS coronavirus (SARS-CoV) (Severe acute respiratory syndrome coronavirus)
Description:
P0C6X7
Residue:
7073
  
Inhibitor
Name:
BDBM429321
Synonyms:
jm5b01461, Compound 141.1
Type:
Small Organic Molecule
Emp. Form.:
C29H34N4O2
Mol. Mass.:
470.6059
SMILES:
O=CC(Cc1c[nH]cn1)NC[C@@H]1C[C@H]2CCCC[C@H]2CN1C(=O)c1ccc(cc1)-c1ccccc1
: