Target
Procathepsin L
Ligand
BDBM429283
Substrate
Meas. Tech.
No assay is provided
IC50
6.90±n/a nM
Citation
 Pillaiyar, TWendt, LLManickam, MEaswaran, M The recent outbreaks of human coronaviruses: A medicinal chemistry perspective. Med Res Rev 0:0 (2020)  
Target
Name:
Procathepsin L
Synonyms:
CATL1_HUMAN CTSL CTSL1 Cathepsin L Cathepsin L1 heavy chain MEP cathepsin L preproprotein
Type:
Enzyme
Mol. Mass.:
37557.19
Organism:
Homo sapiens (Human)
Description:
Purchased from Calbiochem (San Diego, CA).
Residue:
333
  
Inhibitor
Name:
BDBM429283
Synonyms:
med.21724, Compound 21
Type:
Small Organic Molecule
Emp. Form.:
C27H33N5O5S
Mol. Mass.:
539.646
SMILES:
CCc1ccccc1NC(=O)CSC(=O)NNC(=O)C(Cc1c[nH]c2ccccc12)NC(=O)OC(C)(C)C
: