Target
Procathepsin L
Ligand
BDBM50376204
Substrate
Meas. Tech.
No assay is provided
EC50
6400±n/a nM
Citation
 Pillaiyar, TWendt, LLManickam, MEaswaran, M The recent outbreaks of human coronaviruses: A medicinal chemistry perspective. Med Res Rev 0:0 (2020)  
Target
Name:
Procathepsin L
Synonyms:
CATL1_HUMAN CTSL CTSL1 Cathepsin L Cathepsin L1 heavy chain MEP cathepsin L preproprotein
Type:
Enzyme
Mol. Mass.:
37557.19
Organism:
Homo sapiens (Human)
Description:
Purchased from Calbiochem (San Diego, CA).
Residue:
333
  
Inhibitor
Name:
BDBM50376204
Synonyms:
CHEMBL401925 | med.21724, Compound 23
Type:
Small organic molecule
Emp. Form.:
C7H9N3S2
Mol. Mass.:
199.296
SMILES:
CC(=NNC(N)=S)c1cccs1
: