Target
Cystic fibrosis transmembrane conductance regulator
Ligand
BDBM297398
Substrate
Meas. Tech.
Potentiator Assay
EC50
55.0±n/a nM
Citation
 Baettig, UBala, KBudd, EEdwards, LHowsham, CHughes, GALeGrand, DMSpiegel, K Pyridine and pyrazine derivative for the treatment of CF US Patent  US10117858 Publication Date 11/6/2018 
Target
Name:
Cystic fibrosis transmembrane conductance regulator
Synonyms:
ABCC7 CFTR Channel conductance-controlling ATPase | cAMP-dependent chloride channel
Type:
Enzyme Catalytic Domain
Mol. Mass.:
168171.30
Organism:
Homo sapiens (Human)
Description:
gi_90421313
Residue:
1480
  
Inhibitor
Name:
BDBM297398
Synonyms:
3-Amino-6-bromo-5-trifluoromethyl-pyridine-2-carboxylic acid ((S)-3,3,3-trifluoro-2-hydroxy-2-methyl-propyl)-amide | US10117858, Example 3
Type:
Small organic molecule
Emp. Form.:
C11H10BrF6N3O2
Mol. Mass.:
410.11
SMILES:
C[C@](O)(CNC(=O)c1nc(Br)c(cc1N)C(F)(F)F)C(F)(F)F
: