Target
Cystic fibrosis transmembrane conductance regulator
Ligand
BDBM297402
Substrate
Meas. Tech.
Potentiator Assay
EC50
50.0±n/a nM
Citation
 Baettig, UBala, KBudd, EEdwards, LHowsham, CHughes, GALeGrand, DMSpiegel, K Pyridine and pyrazine derivative for the treatment of CF US Patent  US10117858 Publication Date 11/6/2018 
Target
Name:
Cystic fibrosis transmembrane conductance regulator
Synonyms:
ABCC7 CFTR Channel conductance-controlling ATPase | cAMP-dependent chloride channel
Type:
Enzyme Catalytic Domain
Mol. Mass.:
168171.30
Organism:
Homo sapiens (Human)
Description:
gi_90421313
Residue:
1480
  
Inhibitor
Name:
BDBM297402
Synonyms:
US10117858, Example 5
Type:
Small organic molecule
Emp. Form.:
C12H13F6N3O3
Mol. Mass.:
361.2403
SMILES:
COc1nc(C(=O)NC[C@](C)(O)C(F)(F)F)c(N)cc1C(F)(F)F
: