Target
Cystic fibrosis transmembrane conductance regulator
Ligand
BDBM297409
Substrate
Meas. Tech.
Potentiator Assay
EC50
8.00±n/a nM
Citation
 Baettig, UBala, KBudd, EEdwards, LHowsham, CHughes, GALeGrand, DMSpiegel, K Pyridine and pyrazine derivative for the treatment of CF US Patent  US10117858 Publication Date 11/6/2018 
Target
Name:
Cystic fibrosis transmembrane conductance regulator
Synonyms:
ABCC7 CFTR Channel conductance-controlling ATPase | cAMP-dependent chloride channel
Type:
Enzyme Catalytic Domain
Mol. Mass.:
168171.30
Organism:
Homo sapiens (Human)
Description:
gi_90421313
Residue:
1480
  
Inhibitor
Name:
BDBM297409
Synonyms:
US10117858, Example 16
Type:
Small organic molecule
Emp. Form.:
C12H10F9N3O2
Mol. Mass.:
399.2123
SMILES:
C[C@](O)(CNC(=O)c1nc(c(cc1N)C(F)(F)F)C(F)(F)F)C(F)(F)F
: