Target
Prostaglandin F2-alpha receptor
Ligand
BDBM297456
Substrate
Meas. Tech.
In Vitro Test of Inhibition of Human FP Receptor Activity
IC50
68.0±n/a nM
Citation
 Beck, HThaler, TKast, RMeininghaus, MTerjung, CMuenster, UOlenik, B Substituted N-bicyclo-2-aryl-quinolin-4-carboxamides and use thereof US Patent  US10117864 Publication Date 11/6/2018 
Target
Name:
Prostaglandin F2-alpha receptor
Synonyms:
PF2R_HUMAN PGF2 alpha receptor PTGFR Prostanoid FP receptor
Type:
Enzyme
Mol. Mass.:
40072.29
Organism:
Homo sapiens (Human)
Description:
P43088
Residue:
359
  
Inhibitor
Name:
BDBM297456
Synonyms:
Sodium 4-{[(6-bromo-3-methyl-2-phenylquinolin-4-yl)carbonyl]amino}bicyclo[2.2.2]octane-1-carboxylate US10117864, Example 47
Type:
Small organic molecule
Emp. Form.:
C26H24BrN2O3
Mol. Mass.:
492.385
SMILES:
Cc1c(nc2ccc(Br)cc2c1C(=O)NC12CCC(CC1)(CC2)C([O-])=O)-c1ccccc1
: