Target
Replicase polyprotein 1ab
Ligand
BDBM50031706
Substrate
Meas. Tech.
DRC analysis by immunofluorescence
IC50
>50000±n/a nM
Citation
 Jeon, SKo, MLee, JChoi, IByun, SYPark, SShum, DKim, S Identification of Antiviral Drug Candidates against SARS-CoV-2 from FDA-Approved Drugs. Antimicrob Agents Chemother 64:0 (2020)  
Target
Name:
Replicase polyprotein 1ab
Synonyms:
ORF1ab polyprotein pp1ab | rep
Type:
Protein
Mol. Mass.:
794070.71
Organism:
2019-nCoV
Description:
P0DTD1
Residue:
7096
  
Inhibitor
Name:
BDBM50031706
Synonyms:
4-Guanidino-benzoic acid 4-dimethylcarbamoylmethoxycarbonylmethyl-phenyl ester; compound with methanesulfonic acid Camostat | med.21724, Compound 18
Type:
Small organic molecule
Emp. Form.:
C20H22N4O5
Mol. Mass.:
398.4125
SMILES:
[#6]-[#7](-[#6])-[#6](=O)-[#6]-[#8]-[#6](=O)-[#6]-c1ccc(-[#8]-[#6](=O)-c2ccc(cc2)\[#7]=[#6](/[#7])-[#7])cc1
: