Target
Replicase polyprotein 1ab
Ligand
BDBM430637
Substrate
Meas. Tech.
DRC analysis by immunofluorescence
IC50
28000±n/a nM
Citation
 Jeon, SKo, MLee, JChoi, IByun, SYPark, SShum, DKim, S Identification of Antiviral Drug Candidates against SARS-CoV-2 from FDA-Approved Drugs. Antimicrob Agents Chemother 64:0 (2020)  
Target
Name:
Replicase polyprotein 1ab
Synonyms:
ORF1ab polyprotein pp1ab | rep
Type:
Protein
Mol. Mass.:
794070.71
Organism:
2019-nCoV
Description:
P0DTD1
Residue:
7096
  
Inhibitor
Name:
BDBM430637
Synonyms:
Phenazopyridine
Type:
Small Organic Molecule
Emp. Form.:
C11H11N5
Mol. Mass.:
213.2385
SMILES:
Nc1ccc(N=Nc2ccccc2)c(N)n1
: