Target
Replicase polyprotein 1ab
Ligand
BDBM50242977
Substrate
Meas. Tech.
DRC analysis by immunofluorescence
IC50
4470±n/a nM
Citation
 Jeon, SKo, MLee, JChoi, IByun, SYPark, SShum, DKim, S Identification of Antiviral Drug Candidates against SARS-CoV-2 from FDA-Approved Drugs. Antimicrob Agents Chemother 64:0 (2020)  
Target
Name:
Replicase polyprotein 1ab
Synonyms:
ORF1ab polyprotein pp1ab | rep
Type:
Protein
Mol. Mass.:
794070.71
Organism:
2019-nCoV
Description:
P0DTD1
Residue:
7096
  
Inhibitor
Name:
BDBM50242977
Synonyms:
CHEMBL500862 cepharantine
Type:
Small organic molecule
Emp. Form.:
C37H38N2O6
Mol. Mass.:
606.7074
SMILES:
COc1ccc2C[C@@H]3N(C)CCc4cc(OC)c(Oc5c6OCOc6cc6CCN(C)[C@@H](Cc7ccc(Oc1c2)cc7)c56)cc34
: