Target
Neuromedin-K receptor
Ligand
BDBM430729
Substrate
Meas. Tech.
3H-SB222200 Binding Competition Assay with Human NK-3 Receptor
Ki
<500±n/a nM
Citation
 Hoveyda, HRRoy, MFraser, GLDutheuil, G NK-3 receptor selective antagonist compounds, pharmaceutical composition and methods for use in NK-3 receptors mediated disorders US Patent  US10544150 Publication Date 1/28/2020 
Target
Name:
Neuromedin-K receptor
Synonyms:
NK-3 receptor NK3R NKR Neurokinin B receptor Neuromedin-3 receptor (NK-3R) Neuromedin-K receptor Neuromedin-K receptor (NK3) TAC3R Tachykinin receptor 3 | Tachykinin receptor 3 (NK3)
Type:
Enzyme
Mol. Mass.:
52221.96
Organism:
Homo sapiens (Human)
Description:
P29371
Residue:
465
  
Inhibitor
Name:
BDBM430729
Synonyms:
(4-chloro-3-fluorophenyl)(3-(2-(4-fluorophenyl)thiazol-4-yl)-8-methyl-5,6-dihydro-[1,2,4]triazolo[4,3-a]pyrazin-7(8H)-yl)methanone | US10544150, Compound 112
Type:
Small organic molecule
Emp. Form.:
C22H16ClF2N5OS
Mol. Mass.:
471.91
SMILES:
CC1N(CCn2c1nnc2-c1csc(n1)-c1ccc(F)cc1)C(=O)c1ccc(Cl)c(F)c1
: