Target
Guanylate cyclase soluble subunit alpha-1/beta-1
Ligand
BDBM430900
Substrate
Meas. Tech.
CHO Cellular Assay
EC50
303±n/a nM
Citation
 Adams, CMBevan, DCapparelli, MPEhara, TFerrara, LJi, NMeredith, EMogi, MPowers, JJPrasanna, GMainolfi, NKato, M Indane and indoline derivatives and the use thereof as soluble guanylate cyclase activators US Patent  US10550102 Publication Date 2/4/2020 
Target
Name:
Guanylate cyclase soluble subunit alpha-1/beta-1
Synonyms:
Soluble Guanylate Cyclases Soluble guanylate cyclase alpha 1 and beta 1 subunits (sGC) soluble guanylate cyclase activators | soluble guanylate cyclase apha 1 and soluble guanylate cyclase beta 1
Type:
Enzyme
Mol. Mass.:
Description:
Components:
This complex has 2 components.
Component 1
Name:
Guanylate cyclase soluble subunit alpha-1
Synonyms:
GCS-alpha-1 GCYA1_HUMAN GUCSA3 GUCY1A3 Guanylate cyclase soluble subunit alpha-3 Solube guanylate cyclase alpha-1 (sGCalpha) | soluble guanylate cyclase alpha-1 (sGC)
Type:
Enzyme
Mol. Mass.:
77457.21
Organism:
Homo sapiens (Human)
Description:
Q02108
Residue:
690
  
Component 2
Name:
Guanylate cyclase soluble subunit beta-1
Synonyms:
GCYB1_HUMAN GUCSB3 GUCY1B3 Solube guanylate cyclase beta-1 (sGCβ1) | soluble guanylate cyclase beta-1 (sGC)
Type:
Enzyme
Mol. Mass.:
70496.05
Organism:
Homo sapiens (Human)
Description:
Q02153
Residue:
619
  
Inhibitor
Name:
BDBM430900
Synonyms:
US10550102, Example (-)-46-3
Type:
Small organic molecule
Emp. Form.:
C36H39N5O3
Mol. Mass.:
589.7266
SMILES:
Cc1c(cnn1-c1cccc(n1)-c1cccc2CCC(Nc3ccc(cc3C)C3CCN(CC3)C(=O)CC3CC3)c12)C(O)=O
: