Target
Cyclin-dependent kinase 4/G1/S-specific cyclin-D1
Ligand
BDBM6951
Substrate
GST-Rb fusion protein
Meas. Tech.
Kinase Inhibition Assay
pH
7.6±n/a
Temperature
295.15±n/a K
IC50
37500±n/a nM
Citation
 Carini, DJKaltenbach, RFLiu, JBenfield, PABoylan, JBoisclair, MBrizuela, LBurton, CRCox, SGrafstrom, RHarrison, BAHarrison, KAkamike, EMarkwalder, JANakano, YSeitz, SPSharp, DMTrainor, GLSielecki, TM Identification of selective inhibitors of cyclin dependent kinase 4. Bioorg Med Chem Lett 11:2209-11 (2001)  
Target
Name:
Cyclin-dependent kinase 4/G1/S-specific cyclin-D1
Synonyms:
CDK4/CycD CDK4/Cyclin D1 Cyclin-Dependent Kinase 4 (CDK4) Cyclin-dependent kinase 4/G1/S-specific cyclin D1 | Cyclin-dependent kinase 4/cyclin D1
Type:
Protein Complex
Mol. Mass.:
Description:
CDK4/D1 complexes were purified from insect cells co-infected with baculovirus vectors containing each of the components.
Components:
This complex has 2 components.
Component 1
Name:
Cyclin-dependent kinase 4
Synonyms:
CDK4 Cell division protein kinase 4 PSK-J3
Type:
Enzyme Subunit
Mol. Mass.:
33731.96
Organism:
Homo sapiens (Human)
Description:
P11802
Residue:
303
  
Component 2
Name:
G1/S-specific cyclin-D1
Synonyms:
B-cell lymphoma 1 protein BCL-1 oncogene CCND1 PRAD1 | PRAD1 oncogene
Type:
Enzyme Subunit
Mol. Mass.:
33717.70
Organism:
Homo sapiens (Human)
Description:
Residue:
295
  
Inhibitor
Name:
BDBM6951
Synonyms:
15-phenyl-11-azatetracyclo[8.7.0.0^{2,7}.0^{12,17}]heptadeca-1,3,5,7,9,12,14,16-octaen-4-ol | carbazole deriv. 11
Type:
Small organic molecule
Emp. Form.:
C22H15NO
Mol. Mass.:
309.3606
SMILES:
Oc1ccc2ccc3[nH]c4ccc(cc4c3c2c1)-c1ccccc1
:
Substrate
Name:
GST-Rb fusion protein
Synonyms:
Glutathione S-transferase (GST)-retinoblastoma (Rb) fusion RB1 Rb | retinoblastoma
Type:
Other Protein Type
Mol. Mass.:
106410.17
Organism:
Homo sapiens (Human)
Description:
GST-60 kDa Rb fusion protein (comprising amino acids 378 to 928 of retinoblastoma)
Residue:
928