Target
RAC-alpha serine/threonine-protein kinase
Ligand
BDBM431876
Substrate
Meas. Tech.
Biochemical Assays
IC50
190±51.5 nM
Citation
 Rauh, DGontla, RWeisner, J Kinase inhibitors and their use in cancer therapy US Patent  US10550114 Publication Date 2/4/2020 
Target
Name:
RAC-alpha serine/threonine-protein kinase
Synonyms:
AKT phosphorylation (p-AKT) AKT1/PPP1CA C-AKT PKB alpha Protein kinase B Protein kinase B (Akt 1) Protein kinase B alpha Proto-oncogene Akt (Akt1) Proto-oncogene c-Akt (AKT1) RAC-PK-alpha RAC-alpha serine/threonine-protein kinase (AKT1) | RAC-alpha serine/threonine-protein kinase (pAKT)
Type:
Enzyme
Mol. Mass.:
55681.25
Organism:
Homo sapiens (Human)
Description:
P31749
Residue:
480
  
Inhibitor
Name:
BDBM431876
Synonyms:
US10550114, Compound 31
Type:
Small organic molecule
Emp. Form.:
C34H31N5O2
Mol. Mass.:
541.6422
SMILES:
C=CC(=O)Nc1ccc(cc1)N1CCN(Cc2ccc(cc2)-c2nc3cc[nH]c(=O)c3cc2-c2ccccc2)CC1
: