Target
RAC-alpha serine/threonine-protein kinase
Ligand
BDBM431877
Substrate
Meas. Tech.
Biochemical Assays
IC50
1.50±0.2 nM
Citation
 Rauh, DGontla, RWeisner, J Kinase inhibitors and their use in cancer therapy US Patent  US10550114 Publication Date 2/4/2020 
Target
Name:
RAC-alpha serine/threonine-protein kinase
Synonyms:
AKT phosphorylation (p-AKT) AKT1/PPP1CA C-AKT PKB alpha Protein kinase B Protein kinase B (Akt 1) Protein kinase B alpha Proto-oncogene Akt (Akt1) Proto-oncogene c-Akt (AKT1) RAC-PK-alpha RAC-alpha serine/threonine-protein kinase (AKT1) | RAC-alpha serine/threonine-protein kinase (pAKT)
Type:
Enzyme
Mol. Mass.:
55681.25
Organism:
Homo sapiens (Human)
Description:
P31749
Residue:
480
  
Inhibitor
Name:
BDBM431877
Synonyms:
US10550114, Compound 32
Type:
Small organic molecule
Emp. Form.:
C36H33N5O3
Mol. Mass.:
583.6789
SMILES:
C=CC(=O)Nc1cccc(c1)C(=O)NC1CCN(Cc2ccc(cc2)-c2nc3cc[nH]c(=O)c3cc2-c2ccccc2)CC1
: