Target
Tyrosine-protein kinase JAK1
Ligand
BDBM431898
Substrate
Meas. Tech.
Biochemical JAK Kinase Assays
Ki
0.080±n/a nM
Citation
 Fatheree, PRBrandt, GESmith, CSullivan, SDVan Orden, LJKleinschek, MACrater, GD JAK inhibitors containing a 4-membered heterocyclic amide US Patent  US10550118 Publication Date 2/4/2020 
Target
Name:
Tyrosine-protein kinase JAK1
Synonyms:
JAK-1 JAK1A JAK1_HUMAN Janus kinase 1 (JAK1) | Janus kinase 1 JAK1
Type:
Protein
Mol. Mass.:
133293.73
Organism:
Homo sapiens (Human)
Description:
P23458
Residue:
1154
  
Inhibitor
Name:
BDBM431898
Synonyms:
US10550118, Example 8-5
Type:
Small organic molecule
Emp. Form.:
C33H40FN7O2
Mol. Mass.:
585.7148
SMILES:
CCCN1Cc2[nH]c(nc2CC1C(=O)N1CC(C1)N1CCCCC1)-c1n[nH]c2cc(ccc12)-c1cc(F)c(O)cc1CC
: