Target
Complement factor D
Ligand
BDBM335537
Substrate
Meas. Tech.
Human Factor D Assay
IC50
<1000±n/a nM
Citation
 Wiles, JAGadhachanda, VRPais, GHashimoto, AWang, QChen, DWang, XAgarwal, ADeshpande, MPhadke, AS Ether compounds for treatment of complement mediated disorders US Patent  US10550140 Publication Date 2/4/2020 
Target
Name:
Complement factor D
Synonyms:
Adipsin CFAD_HUMAN DF Properdin factor D
Type:
Protein
Mol. Mass.:
27039.19
Organism:
Homo sapiens (Human)
Description:
P00746
Residue:
253
  
Inhibitor
Name:
BDBM335537
Synonyms:
(3-acetyl-1-(2-((2S,4R)- 4-fluoro-2-(2-fluoro-3- (trifluoromethoxy)phenyl- carbamoyl)pyrrolidin-1- yl)-2-oxoethyl)-1H-indol- 6-yloxy)methylphosphonic acid US9732104, Compound 27
Type:
Small organic molecule
Emp. Form.:
C25H23F5N3O8P
Mol. Mass.:
619.4312
SMILES:
CC(=O)c1cn(CC(=O)N2C[C@H](F)C[C@H]2C(=O)Nc2cccc(OC(F)(F)F)c2F)c2cc(OCP(O)(O)=O)ccc12
: