Target
E3 ubiquitin-protein ligase Mdm2 [23-127]
Ligand
BDBM431971
Substrate
Meas. Tech.
MDM2-p53 Inhibition AlphaScreen
IC50
193±n/a nM
Citation
 Weinstabl, HGollner, ARamharter, JWunberg, T Spiro[3H-indole-3,2′-pyrrolidin]-2(1H)-one compounds and derivatives as MDM2-P53 inhibitors US Patent  US10576064 Publication Date 3/3/2020 
Target
Name:
E3 ubiquitin-protein ligase Mdm2 [23-127]
Synonyms:
MDM2 MDM2_HUMAN
Type:
Oncoprotein
Mol. Mass.:
12198.94
Organism:
Homo sapiens (Human)
Description:
Q00987[23-127]
Residue:
105
  
Inhibitor
Name:
BDBM431971
Synonyms:
US10576064, Example I-92
Type:
Small organic molecule
Emp. Form.:
C29H25Cl2FN4O2
Mol. Mass.:
551.439
SMILES:
Fc1c(Cl)cccc1[C@H]1[C@H]2[C@H](CCN(C2=O)c2ccncc2)N(CC2CC2)[C@@]11C(=O)Nc2cc(Cl)ccc12
: