Target
E3 ubiquitin-protein ligase Mdm2 [23-127]
Ligand
BDBM432007
Substrate
Meas. Tech.
MDM2-p53 Inhibition AlphaScreen
IC50
17.0±n/a nM
Citation
 Weinstabl, HGollner, ARamharter, JWunberg, T Spiro[3H-indole-3,2′-pyrrolidin]-2(1H)-one compounds and derivatives as MDM2-P53 inhibitors US Patent  US10576064 Publication Date 3/3/2020 
Target
Name:
E3 ubiquitin-protein ligase Mdm2 [23-127]
Synonyms:
MDM2 MDM2_HUMAN
Type:
Oncoprotein
Mol. Mass.:
12198.94
Organism:
Homo sapiens (Human)
Description:
Q00987[23-127]
Residue:
105
  
Inhibitor
Name:
BDBM432007
Synonyms:
US10576064, Example I-224
Type:
Small organic molecule
Emp. Form.:
C29H24Cl2FN3O5
Mol. Mass.:
584.422
SMILES:
COCCN1[C@H]2CN(C(=O)[C@H]2[C@H](c2cccc(Cl)c2F)[C@]11C(=O)Nc2cc(Cl)ccc12)c1ccc(cc1)C(O)=O
: