Target
E3 ubiquitin-protein ligase Mdm2 [23-127]
Ligand
BDBM432021
Substrate
Meas. Tech.
MDM2-p53 Inhibition AlphaScreen
IC50
4.00±n/a nM
Citation
 Weinstabl, HGollner, ARamharter, JWunberg, T Spiro[3H-indole-3,2′-pyrrolidin]-2(1H)-one compounds and derivatives as MDM2-P53 inhibitors US Patent  US10576064 Publication Date 3/3/2020 
Target
Name:
E3 ubiquitin-protein ligase Mdm2 [23-127]
Synonyms:
MDM2 MDM2_HUMAN
Type:
Oncoprotein
Mol. Mass.:
12198.94
Organism:
Homo sapiens (Human)
Description:
Q00987[23-127]
Residue:
105
  
Inhibitor
Name:
BDBM432021
Synonyms:
US10576064, Example I-244
Type:
Small organic molecule
Emp. Form.:
C29H23Cl2FN4O4
Mol. Mass.:
581.422
SMILES:
OC(=O)c1ccc(cc1)N1C[C@H]2[C@H]([C@H](c3ccnc(Cl)c3F)[C@@]3(N2CC2CC2)C(=O)Nc2cc(Cl)ccc32)C1=O
: