Target
E3 ubiquitin-protein ligase Mdm2 [23-127]
Ligand
BDBM432023
Substrate
Meas. Tech.
MDM2-p53 Inhibition AlphaScreen
IC50
485±n/a nM
Citation
 Weinstabl, HGollner, ARamharter, JWunberg, T Spiro[3H-indole-3,2′-pyrrolidin]-2(1H)-one compounds and derivatives as MDM2-P53 inhibitors US Patent  US10576064 Publication Date 3/3/2020 
Target
Name:
E3 ubiquitin-protein ligase Mdm2 [23-127]
Synonyms:
MDM2 MDM2_HUMAN
Type:
Oncoprotein
Mol. Mass.:
12198.94
Organism:
Homo sapiens (Human)
Description:
Q00987[23-127]
Residue:
105
  
Inhibitor
Name:
BDBM432023
Synonyms:
US10576064, Example I-248
Type:
Small organic molecule
Emp. Form.:
C36H30Cl2FN3O5
Mol. Mass.:
674.545
SMILES:
CCOc1cccc(CN2[C@H]3CN(Cc4ccc(cc4)C(O)=O)C(=O)[C@H]3[C@H](c3cccc(Cl)c3F)[C@@]22C(=O)Nc3cc(Cl)ccc23)c1
: