Target
E3 ubiquitin-protein ligase Mdm2 [23-127]
Ligand
BDBM432026
Substrate
Meas. Tech.
MDM2-p53 Inhibition AlphaScreen
IC50
9.00±n/a nM
Citation
 Weinstabl, HGollner, ARamharter, JWunberg, T Spiro[3H-indole-3,2′-pyrrolidin]-2(1H)-one compounds and derivatives as MDM2-P53 inhibitors US Patent  US10576064 Publication Date 3/3/2020 
Target
Name:
E3 ubiquitin-protein ligase Mdm2 [23-127]
Synonyms:
MDM2 MDM2_HUMAN
Type:
Oncoprotein
Mol. Mass.:
12198.94
Organism:
Homo sapiens (Human)
Description:
Q00987[23-127]
Residue:
105
  
Inhibitor
Name:
BDBM432026
Synonyms:
US10576064, Example I-254
Type:
Small organic molecule
Emp. Form.:
C30H23BrClF2N3O4
Mol. Mass.:
642.875
SMILES:
OC(=O)c1ccc(cc1F)N1C[C@H]2[C@H]([C@H](c3cccc(Br)c3F)[C@@]3(N2CC2CC2)C(=O)Nc2cc(Cl)ccc32)C1=O
: