Target
Serine/threonine-protein kinase B-raf [V600E]
Ligand
BDBM372968
Substrate
Meas. Tech.
Raf IC50 Assay Protocol
IC50
53.0±n/a nM
Citation
 Zhou, CWang, SZhang, G Fused tricyclic compounds as Raf kinase inhibitors US Patent  US10576087 Publication Date 3/3/2020 
Target
Name:
Serine/threonine-protein kinase B-raf [V600E]
Synonyms:
B-RAF V600E B-Raf Protein Kinase Mutant (V600E) BRAF BRAF mutant V600E BRAF_HUMAN Protein mono-ADP-ribosyltransferase (PARP3) RAFB1 Serine/threonine-protein kinase B-raf (V600E) V-RAF murine sarcoma viral oncogene homologue B1 mutant (BRAF V600E)
Type:
Mol. Mass.:
84474.98
Organism:
Homo sapiens (Human)
Description:
P15056 V600E
Residue:
766
  
Inhibitor
Name:
BDBM372968
Synonyms:
US10576087, Compound 2.2b | US9895376, Compound 2.2b
Type:
Small organic molecule
Emp. Form.:
C25H17F3N4O3
Mol. Mass.:
478.4227
SMILES:
FC(F)(F)c1ccc2nc([nH]c2c1)[C@@H]1[C@H]2Oc3ccc(Oc4ccnc5NC(=O)CCc45)cc3[C@@H]12
: