Target
Serine/threonine-protein kinase B-raf [V600E]
Ligand
BDBM210022
Substrate
Meas. Tech.
Raf IC50 Assay Protocol
IC50
3.70±n/a nM
Citation
 Zhou, CWang, SZhang, G Fused tricyclic compounds as Raf kinase inhibitors US Patent  US10576087 Publication Date 3/3/2020 
Target
Name:
Serine/threonine-protein kinase B-raf [V600E]
Synonyms:
B-RAF V600E B-Raf Protein Kinase Mutant (V600E) BRAF BRAF mutant V600E BRAF_HUMAN Protein mono-ADP-ribosyltransferase (PARP3) RAFB1 Serine/threonine-protein kinase B-raf (V600E) V-RAF murine sarcoma viral oncogene homologue B1 mutant (BRAF V600E)
Type:
Mol. Mass.:
84474.98
Organism:
Homo sapiens (Human)
Description:
P15056 V600E
Residue:
766
  
Inhibitor
Name:
BDBM210022
Synonyms:
US10576087, Compound 2.31 US9895376, Compound 2.31
Type:
Small organic molecule
Emp. Form.:
C25H19N5O3
Mol. Mass.:
437.4501
SMILES:
O=C1CCc2c(Oc3ccc4OC5C(C5c4c3)c3nc(c[nH]3)-c3ccncc3)ccnc2N1
: