Target
Integrin alpha-V/beta-5
Ligand
BDBM432094
Substrate
Meas. Tech.
Solid Phase Receptor Assay (SPRA) for alphavbeta5 Function
IC50
2.00±n/a nM
Citation
 Ruminski, PGGriggs, DW Meta-azacyclic amino benzoic acid derivatives as pan integrin antagonists US Patent  US10577330 Publication Date 3/3/2020 
Target
Name:
Integrin alpha-V/beta-5
Synonyms:
ITGAV/ITGB5 | Integrin beta-5/Vitronectin receptor alpha
Type:
Enzyme
Mol. Mass.:
Description:
Components:
This complex has 2 components.
Component 1
Name:
Integrin alpha-V
Synonyms:
ITAV_HUMAN Integrin alpha-V/alpha-5 VNRA Vitronectin receptor | Vitronectin receptor subunit alpha
Type:
PROTEIN
Mol. Mass.:
116024.92
Organism:
Homo sapiens (Human)
Description:
ChEMBL_582336
Residue:
1048
  
Component 2
Name:
Integrin beta-5
Synonyms:
ITB5_HUMAN | ITGB5
Type:
PROTEIN
Mol. Mass.:
88047.37
Organism:
Homo sapiens (Human)
Description:
EBI_10915
Residue:
799
  
Inhibitor
Name:
BDBM432094
Synonyms:
US10577330, Comparison Compound C3
Type:
Small organic molecule
Emp. Form.:
C22H23Cl2N5O7
Mol. Mass.:
540.353
SMILES:
OC1CNC(Nc2cc(O)cc(c2)C(=O)NCC(=O)NC(CC(O)=O)c2cc(Cl)cc(Cl)c2O)=NC1
: