Target
Integrin alpha-V/beta-3
Ligand
BDBM432099
Substrate
Meas. Tech.
Solid Phase Receptor Assay (SPRA) for alphavbeta3 Function
IC50
5.00±n/a nM
Citation
 Ruminski, PGGriggs, DW Meta-azacyclic amino benzoic acid derivatives as pan integrin antagonists US Patent  US10577330 Publication Date 3/3/2020 
Target
Name:
Integrin alpha-V/beta-3
Synonyms:
ITGAV/ITGB3 | Integrin beta-3/Vitronectin receptor alpha
Type:
Enzyme
Mol. Mass.:
Description:
Components:
This complex has 2 components.
Component 1
Name:
Integrin alpha-V
Synonyms:
ITAV_HUMAN Integrin alpha-V/alpha-5 VNRA Vitronectin receptor | Vitronectin receptor subunit alpha
Type:
PROTEIN
Mol. Mass.:
116024.92
Organism:
Homo sapiens (Human)
Description:
ChEMBL_582336
Residue:
1048
  
Component 2
Name:
Integrin beta-3
Synonyms:
CD_antigen=CD61 GPIIIa ITGB3 Platelet membrane glycoprotein IIIa
Type:
Protein
Mol. Mass.:
87038.91
Organism:
Homo sapiens (Human)
Description:
P05106
Residue:
788
  
Inhibitor
Name:
BDBM432099
Synonyms:
US10577330, Comparison Compound C8
Type:
Small organic molecule
Emp. Form.:
C20H23N5O5
Mol. Mass.:
413.4271
SMILES:
Cc1ccc(O)c(c1)C(CC(O)=O)NC(=O)CNC(=O)c1cccc(NC(N)=N)c1
: