Target
Integrin alpha-V/beta-5
Ligand
BDBM432100
Substrate
Meas. Tech.
Solid Phase Receptor Assay (SPRA) for alphavbeta5 Function
IC50
0.400±n/a nM
Citation
 Ruminski, PGGriggs, DW Meta-azacyclic amino benzoic acid derivatives as pan integrin antagonists US Patent  US10577330 Publication Date 3/3/2020 
Target
Name:
Integrin alpha-V/beta-5
Synonyms:
ITGAV/ITGB5 | Integrin beta-5/Vitronectin receptor alpha
Type:
Enzyme
Mol. Mass.:
Description:
Components:
This complex has 2 components.
Component 1
Name:
Integrin alpha-V
Synonyms:
ITAV_HUMAN Integrin alpha-V/alpha-5 VNRA Vitronectin receptor | Vitronectin receptor subunit alpha
Type:
PROTEIN
Mol. Mass.:
116024.92
Organism:
Homo sapiens (Human)
Description:
ChEMBL_582336
Residue:
1048
  
Component 2
Name:
Integrin beta-5
Synonyms:
ITB5_HUMAN | ITGB5
Type:
PROTEIN
Mol. Mass.:
88047.37
Organism:
Homo sapiens (Human)
Description:
EBI_10915
Residue:
799
  
Inhibitor
Name:
BDBM432100
Synonyms:
US10577330, Comparison Compound C9
Type:
Small organic molecule
Emp. Form.:
C20H19F4N5O4
Mol. Mass.:
469.3896
SMILES:
NC(=N)Nc1cccc(c1)C(=O)NCC(=O)NC(CC(O)=O)c1cc(F)cc(c1)C(F)(F)F
: