Target
Integrin alpha-V/beta-3
Ligand
BDBM279563
Substrate
Meas. Tech.
Solid Phase Receptor Assay (SPRA) for alphavbeta3 Function
IC50
3.00±n/a nM
Citation
 Ruminski, PGGriggs, DW Meta-azacyclic amino benzoic acid derivatives as pan integrin antagonists US Patent  US10577330 Publication Date 3/3/2020 
Target
Name:
Integrin alpha-V/beta-3
Synonyms:
ITGAV/ITGB3 | Integrin beta-3/Vitronectin receptor alpha
Type:
Enzyme
Mol. Mass.:
Description:
Components:
This complex has 2 components.
Component 1
Name:
Integrin alpha-V
Synonyms:
ITAV_HUMAN Integrin alpha-V/alpha-5 VNRA Vitronectin receptor | Vitronectin receptor subunit alpha
Type:
PROTEIN
Mol. Mass.:
116024.92
Organism:
Homo sapiens (Human)
Description:
ChEMBL_582336
Residue:
1048
  
Component 2
Name:
Integrin beta-3
Synonyms:
CD_antigen=CD61 GPIIIa ITGB3 Platelet membrane glycoprotein IIIa
Type:
Protein
Mol. Mass.:
87038.91
Organism:
Homo sapiens (Human)
Description:
P05106
Residue:
788
  
Inhibitor
Name:
BDBM279563
Synonyms:
(3S)-3-[3-bromo-5-(difluoromethyl)phenyl)-3-(2-(3-hydroxy-5-((5-hydroxy-1,4,5,6-tetrahydropyrimidin-2-yl)amino)benzamido)acetamido]propanoic acid US10577330, Example 4
Type:
Small organic molecule
Emp. Form.:
C23H24BrF2N5O6
Mol. Mass.:
584.367
SMILES:
OC1CNC(Nc2cc(O)cc(c2)C(=O)NCC(=O)N[C@@H](CC(O)=O)c2cc(Br)cc(c2)C(F)F)=NC1
: