Target
Integrin alpha-5/alpha-V
Ligand
BDBM279567
Substrate
Meas. Tech.
Solid Phase Receptor Assay (SPRA) for alphavbeta1 Function
IC50
1.000±n/a nM
Citation
 Ruminski, PGGriggs, DW Meta-azacyclic amino benzoic acid derivatives as pan integrin antagonists US Patent  US10577330 Publication Date 3/3/2020 
Target
Name:
Integrin alpha-5/alpha-V
Synonyms:
Integrin alpha-V/alpha-5 | Integrin alphavbeta1
Type:
Protein
Mol. Mass.:
Description:
Components:
This complex has 2 components.
Component 1
Name:
Integrin alpha-5
Synonyms:
CD49 antigen-like family member E FNRA Fibronectin receptor subunit alpha ITGA5 Integrin alpha-F | VLA-5
Type:
Single-pass type I membrane protein
Mol. Mass.:
114523.00
Organism:
Homo sapiens (Human)
Description:
Residue:
1049
  
Component 2
Name:
Integrin alpha-V
Synonyms:
ITAV_HUMAN Integrin alpha-V/alpha-5 VNRA Vitronectin receptor | Vitronectin receptor subunit alpha
Type:
PROTEIN
Mol. Mass.:
116024.92
Organism:
Homo sapiens (Human)
Description:
ChEMBL_582336
Residue:
1048
  
Inhibitor
Name:
BDBM279567
Synonyms:
(3S)-3-(3-bromo-5-chloro-phenyl)-3-[[2-[[5-[(5-hydroxy-1,4,5,6-tetrahydropyrimidin-2-yl)amino]pyridine-3-carbonyl]amino]acetyl]amino]propanoic acid US10577330, Example 8
Type:
Small organic molecule
Emp. Form.:
C21H22BrClN6O5
Mol. Mass.:
553.794
SMILES:
OC1CNC(Nc2cncc(c2)C(=O)NCC(=O)N[C@@H](CC(O)=O)c2cc(Cl)cc(Br)c2)=NC1
: