Target
Integrin alpha-V/beta-8
Ligand
BDBM279570
Substrate
Meas. Tech.
Solid Phase Receptor Assay (SPRA) for alphavbeta8 Function
IC50
0.600±n/a nM
Citation
 Ruminski, PGGriggs, DW Meta-azacyclic amino benzoic acid derivatives as pan integrin antagonists US Patent  US10577330 Publication Date 3/3/2020 
Target
Name:
Integrin alpha-V/beta-8
Synonyms:
ITGAV/ITGB8 Integrin alpha-V/beta-8 | Integrin alphavbeta8
Type:
Enzyme
Mol. Mass.:
Description:
Components:
This complex has 2 components.
Component 1
Name:
Integrin alpha-V
Synonyms:
ITAV_HUMAN Integrin alpha-V/alpha-5 VNRA Vitronectin receptor | Vitronectin receptor subunit alpha
Type:
PROTEIN
Mol. Mass.:
116024.92
Organism:
Homo sapiens (Human)
Description:
ChEMBL_582336
Residue:
1048
  
Component 2
Name:
Integrin beta-8
Synonyms:
ITB8_HUMAN | ITGB8
Type:
Protein
Mol. Mass.:
85643.68
Organism:
Homo sapiens (Human)
Description:
Residue:
769
  
Inhibitor
Name:
BDBM279570
Synonyms:
(3S)-3-[3-bromo-5-methyl-phenyl)-3-(2-(3-hydroxy-5-((5-hydroxy-1,4,5,6-tetrahydropyrimidin-2-yl)amino)benzamido)acetamido)propanoic acid US10577330, Example 11
Type:
Small organic molecule
Emp. Form.:
C23H26BrN5O6
Mol. Mass.:
548.386
SMILES:
Cc1cc(Br)cc(c1)[C@H](CC(O)=O)NC(=O)CNC(=O)c1cc(O)cc(NC2=NCC(O)CN2)c1
: