Target
Cyclin-dependent kinase 2/G1/S-specific cyclin-E1
Ligand
BDBM6988
Substrate
GST-Rb fusion protein
Meas. Tech.
Kinase Inhibition Assay
IC50
545±n/a nM
Citation
 Sielecki, TMJohnson, TLLiu, JMuckelbauer, JKGrafstrom, RHCox, SBoylan, JBurton, CRChen, HSmallwood, AChang, CHBoisclair, MBenfield, PATrainor, GLSeitz, SP Quinazolines as cyclin dependent kinase inhibitors. Bioorg Med Chem Lett 11:1157-60 (2001)  
Target
Name:
Cyclin-dependent kinase 2/G1/S-specific cyclin-E1
Synonyms:
CDK2/CycE CDK2/E Cyclin-Dependent Kinase 2 (CDK2) Cyclin-dependent kinase 2/cyclin E1
Type:
Protein
Mol. Mass.:
Description:
Components:
This complex has 2 components.
Component 1
Name:
Cyclin-dependent kinase 2
Synonyms:
CDK2 CDK2_HUMAN Cell division protein kinase 2 Protein cereblon/Cyclin-dependent kinase 2 | p33 protein kinase
Type:
Enzyme Subunit
Mol. Mass.:
33938.17
Organism:
Homo sapiens (Human)
Description:
P24941
Residue:
298
  
Component 2
Name:
G1/S-specific cyclin-E1
Synonyms:
CCNE CCNE1_HUMAN
Type:
Enzyme Subunit
Mol. Mass.:
47073.17
Organism:
Homo sapiens (Human)
Description:
Residue:
410
  
Inhibitor
Name:
BDBM6988
Synonyms:
6-substituted quinazoline 38 | N-tert-butyl-6-(thiophen-3-yl)-2-(trifluoromethyl)quinazolin-4-amine
Type:
Small organic molecule
Emp. Form.:
C17H16F3N3S
Mol. Mass.:
351.389
SMILES:
CC(C)(C)Nc1nc(nc2ccc(cc12)-c1ccsc1)C(F)(F)F
:
Substrate
Name:
GST-Rb fusion protein
Synonyms:
Glutathione S-transferase (GST)-retinoblastoma (Rb) fusion RB1 Rb | retinoblastoma
Type:
Other Protein Type
Mol. Mass.:
106410.17
Organism:
Homo sapiens (Human)
Description:
GST-60 kDa Rb fusion protein (comprising amino acids 378 to 928 of retinoblastoma)
Residue:
928