Target
Somatostatin receptor type 4
Ligand
BDBM275909
Substrate
Meas. Tech.
Camp Assay
EC50
192±n/a nM
Citation
 Mazzaferro, RFerrara, MGiovannini, RLingard, IRudolf, K Morpholine and 1,4-oxazepane amides as somatostatin receptor subtype 4 (SSTR4) agonists US Patent  US10577336 Publication Date 3/3/2020 
Target
Name:
Somatostatin receptor type 4
Synonyms:
SOMATOSTATIN SST4 SS4-R SSR4_HUMAN SSTR4 | Somatostatin receptor type 4 (SSTR4)
Type:
Enzyme
Mol. Mass.:
42015.38
Organism:
Homo sapiens (Human)
Description:
P31391
Residue:
388
  
Inhibitor
Name:
BDBM275909
Synonyms:
US10071974, Example 20 US10071974, Example 22 | US10577336, Example 22
Type:
Small organic molecule
Emp. Form.:
C17H24N4O2
Mol. Mass.:
316.3981
SMILES:
Cn1nc(c2ccccc12)C(C)(C)NC(=O)C1CNCCOC1
: